BDBM221570 US9303045, 56::US9695195, 56
SMILES CN1C2CCC1CC(C2)OC(=O)c1cn(CCF)c2ccccc12
InChI Key InChIKey=ZFNXREFERDBQEK-UHFFFAOYSA-N
Data  2 IC50
  Tab Delimited (TSV)   2D SDfile   Computed 3D by Vconf -m prep SDfile
Find this compound or compounds like it in BindingDB:
Activity Spreadsheet -- Enzyme Inhibition Constant Data from BindingDB
Found 2 hits for monomerid = 221570
Target5-hydroxytryptamine receptor 3A(Homo sapiens (Human))
Takeda Pharmaceutical
US Patent
LigandPNGBDBM221570(US9303045, 56 | US9695195, 56)
Affinity DataIC50:  0.530nMT: 2°C. Assay description: The 5HT3 antagonist activity of the compounds of the invention was determined by measuring the ability of the compounds to inhibit the calcium flux a...
Ligand InfoKEGGPC cidPC sid
In DepthDetails US Patent
Target5-hydroxytryptamine receptor 3A(Homo sapiens (Human))
Takeda Pharmaceutical
US Patent
LigandPNGBDBM221570(US9303045, 56 | US9695195, 56)
Affinity DataIC50:  0.530nMT: 2°C. Assay description: The 5HT3 antagonist activity of the compounds of the invention was determined by measuring the ability of the compounds to inhibit the calcium flux a...
Ligand InfoKEGGPC cidPC sid
In DepthDetails US Patent