BDBM222357 IPR-1192 (10)
SMILES Cc1ccc(cc1Br)N1C(C(C(=O)c2ccc(Cl)cc2)=C(O)C1=O)c1ccccc1F
InChI Key InChIKey=PWENACZANBKBTL-UHFFFAOYSA-N
Data  1 KI  1 IC50
  Tab Delimited (TSV)   2D SDfile   Computed 3D by Vconf -m prep SDfile
Find this compound or compounds like it in BindingDB:
Activity Spreadsheet -- Enzyme Inhibition Constant Data from BindingDB
Found 1 hit for monomerid = 222357
TargetUrokinase plasminogen activator surface receptor(Homo sapiens (Human))
Indiana University School of Medicine
LigandPNGBDBM222357(IPR-1192 (10))
Affinity DataKi:  1.90E+3nM IC50:  3.01E+4nM. Assay description: Polarized fluorescence intensities were measured using an EnVision Multilabel plate reader (PerkinElmer) with excitation and emission wavelengths of ...
Ligand InfoPC cidPC sid
In DepthDetails ArticlePubMed