BDBM222363 IPR-1186 (16)
SMILES OC1=C(C(N(C1=O)c1ccccc1OCc1ccccc1)c1cccc(F)c1)C(=O)c1ccc(Cl)cc1
InChI Key InChIKey=ZCOITIRFFPMFGV-UHFFFAOYSA-N
Data  1 KI  1 IC50
  Tab Delimited (TSV)   2D SDfile   Computed 3D by Vconf -m prep SDfile
Find this compound or compounds like it in BindingDB:
Activity Spreadsheet -- Enzyme Inhibition Constant Data from BindingDB
Found 1 hit for monomerid = 222363
TargetUrokinase plasminogen activator surface receptor(Homo sapiens (Human))
Indiana University School of Medicine
LigandPNGBDBM222363(IPR-1186 (16))
Affinity DataKi:  2.10E+3nM IC50:  3.53E+4nM. Assay description: Polarized fluorescence intensities were measured using an EnVision Multilabel plate reader (PerkinElmer) with excitation and emission wavelengths of ...
Ligand InfoPC cidPC sid
In DepthDetails ArticlePubMed