BDBM222368 IPR-1183 (21)
SMILES COc1cccc(c1)C1N(C(=O)C(O)=C1C(=O)c1ccccc1)c1ccc(C)c(Br)c1
InChI Key InChIKey=SXZCXOOZTVLGKD-UHFFFAOYSA-N
Data  1 KI  1 IC50
  Tab Delimited (TSV)   2D SDfile   Computed 3D by Vconf -m prep SDfile
Find this compound or compounds like it in BindingDB:
Activity Spreadsheet -- Enzyme Inhibition Constant Data from BindingDB
Found 1 hit for monomerid = 222368
TargetUrokinase plasminogen activator surface receptor(Homo sapiens (Human))
Indiana University School of Medicine
LigandPNGBDBM222368(IPR-1183 (21))
Affinity DataKi:  1.33E+4nM IC50:  9.11E+4nM. Assay description: Polarized fluorescence intensities were measured using an EnVision Multilabel plate reader (PerkinElmer) with excitation and emission wavelengths of ...
In DepthDetails ArticlePubMed