BDBM222391 IPR-1607 (44)
SMILES OC1=C(C(N(C1=O)c1ccc(cc1)-c1ccccc1)c1cccc(F)c1)C(=O)c1ccc(Cl)cc1
InChI Key InChIKey=XLLHNTMJUHXIDG-UHFFFAOYSA-N
Data  1 KI  1 IC50
  Tab Delimited (TSV)   2D SDfile   Computed 3D by Vconf -m prep SDfile
Find this compound or compounds like it in BindingDB:
Activity Spreadsheet -- Enzyme Inhibition Constant Data from BindingDB
Found 1 hit for monomerid = 222391
TargetUrokinase plasminogen activator surface receptor(Homo sapiens (Human))
Indiana University School of Medicine
LigandPNGBDBM222391(IPR-1607 (44))
Affinity DataKi:  800nM IC50:  2.40E+4nM. Assay description: Polarized fluorescence intensities were measured using an EnVision Multilabel plate reader (PerkinElmer) with excitation and emission wavelengths of ...
Ligand InfoPC cidPC sid
In DepthDetails ArticlePubMed