BDBM222988 US9315518, 24-20
SMILES CN1c2nc(ccc2N(CC2CC2(F)F)S1(=O)=O)C1=CCN(C1)C(=O)c1ccon1
InChI Key InChIKey=WINCCLNWCXNRGO-UHFFFAOYSA-N
Data  1 EC50
  Tab Delimited (TSV)   2D SDfile   Computed 3D by Vconf -m prep SDfile
Find this compound or compounds like it in BindingDB:
Activity Spreadsheet -- Enzyme Inhibition Constant Data from BindingDB
Found 1 hit for monomerid = 222988
LigandPNGBDBM222988(US9315518, 24-20)
Affinity DataEC50:  177nM. Assay description: The compounds of the present invention may be tested in a fluorescence laser imaging plate reader (FLIPR) based assay. This assay is a common functio...
Ligand InfoPC cidPC sid
In DepthDetails US Patent