BDBM225502 GTC000211A
SMILES FC(F)(F)c1ccc(NC(=O)Cc2ccc(Nc3nccc(Nc4cccc5[nH]ncc45)n3)cc2)cc1
InChI Key InChIKey=SEOKKQHXOQKAFV-UHFFFAOYSA-N
Data  2 IC50
  Tab Delimited (TSV)   2D SDfile   Computed 3D by Vconf -m prep SDfile
Find this compound or compounds like it in BindingDB:
Activity Spreadsheet -- Enzyme Inhibition Constant Data from BindingDB
Found 2 hits for monomerid = 225502
TargetTyrosine-protein kinase SYK [355-635](Homo sapiens (Human))
D3R/Abbott
LigandPNGBDBM225502(GTC000211A)
Affinity DataIC50: <1.58E+4nM. Assay description: SYK assay_HTRF
Ligand InfoPC cidPC sid
In DepthDetails PubMed
TargetTyrosine-protein kinase SYK [355-635](Homo sapiens (Human))
D3R/Abbott
LigandPNGBDBM225502(GTC000211A)
Affinity DataIC50:  2.93E+3nM. Assay description: SYK assay_HTRF
Ligand InfoPC cidPC sid
In DepthDetails PubMed