BDBM225507 GTC000216A
SMILES O=C(Cc1ccc(Nc2nccc(Nc3cccc4[nH]ncc34)n2)cc1)Nc1ccncc1
InChI Key InChIKey=JNWFBSWOXOZEII-UHFFFAOYSA-N
Data  1 IC50
  Tab Delimited (TSV)   2D SDfile   Computed 3D by Vconf -m prep SDfile
Find this compound or compounds like it in BindingDB:
Activity Spreadsheet -- Enzyme Inhibition Constant Data from BindingDB
Found 1 hit for monomerid = 225507
TargetTyrosine-protein kinase SYK [355-635](Homo sapiens (Human))
D3R/Abbott
LigandPNGBDBM225507(GTC000216A)
Affinity DataIC50:  828nM. Assay description: SYK assay_HTRF
Ligand InfoPC cidPC sid
In DepthDetails PubMed