BDBM227647 HDSKGQTKLLQLLTTKSDQM::SCR-2 peptide
SMILES CSCC[C@H](NC(=O)[C@H](CCC(N)=O)NC(=O)[C@H](CC(O)=O)NC(=O)[C@H](CO)NC(=O)[C@H](CCCCN)NC(=O)[C@@H](NC(=O)[C@@H](NC(=O)[C@H](CC(C)C)NC(=O)[C@H](CC(C)C)NC(=O)[C@H](CCC(N)=O)NC(=O)[C@H](CC(C)C)NC(=O)[C@H](CC(C)C)NC(=O)[C@H](CCCCN)NC(=O)[C@@H](NC(=O)[C@H](CCC(N)=O)NC(=O)CNC(=O)[C@H](CCCCN)NC(=O)[C@H](CO)NC(=O)[C@H](CC(O)=O)NC(=O)[C@@H](N)Cc1cnc[nH]1)[C@@H](C)O)[C@@H](C)O)[C@@H](C)O)C(O)=O
InChI Key
Data  1 Kd
  Tab Delimited (TSV)   2D SDfile   Computed 3D by Vconf -m prep SDfile
Find this compound or compounds like it in BindingDB:
Activity Spreadsheet -- Enzyme Inhibition Constant Data from BindingDB
Found 1 hit for monomerid = 227647
TargetAndrogen receptor [646-919](Homo sapiens (Human))
Karlsruhe Institute Of Technology
LigandPNGBDBM227647(HDSKGQTKLLQLLTTKSDQM | SCR-2 peptide)
Affinity DataKd:  2.80E+3nMpH: 6.5Assay Description:For the fluorescence polarization experiments, 5 nM fluorescently labeled Bag-1L (Bag-1L(1-20), fluorescein isothiocyanate (FITC)-MAQRGGARRPRGDRERLGS...
Ligand InfoPC cidPC sid
In DepthDetails ArticlePubMed