BDBM23268 (2E)-3-(4-fluorophenyl)-N-hydroxyprop-2-enamide::Cinnamic hydroxamate deriv., 12
SMILES ONC(=O)\C=C\c1ccc(F)cc1
InChI Key InChIKey=SCPSOYBREZOKTD-ZZXKWVIFSA-N
Data  1 IC50
  Tab Delimited (TSV)   2D SDfile   Computed 3D by Vconf -m prep SDfile
Find this compound or compounds like it in BindingDB:
Activity Spreadsheet -- Enzyme Inhibition Constant Data from BindingDB
Found 1 hit for monomerid = 23268
TargetBotulinum neurotoxin type A2 [1-425](Clostridium botulinum)
The Scripps Research Institute
LigandPNGBDBM23268((2E)-3-(4-fluorophenyl)-N-hydroxyprop-2-enamide | ...)
Affinity DataIC50:  5.40E+4nMpH: 7.4 T: 2°C. Assay description: Recombinant BoNT LC/A activity was measured in black 96-well microtiter plates by use of a Molecular Devices (Sunnyvale, CA) SpectraMax GeminiEM plat...
In DepthDetails ArticlePubMed