BDBM23280 6-chloro-N-hydroxy-1H-indene-2-carboxamide::hydroxamate derivative, 4a
SMILES ONC(=O)C1=Cc2ccc(Cl)cc2C1
InChI Key InChIKey=AAOBGMNEDOOCPJ-UHFFFAOYSA-N
Data  1 IC50
  Tab Delimited (TSV)   2D SDfile   Computed 3D by Vconf -m prep SDfile
Find this compound or compounds like it in BindingDB:
Activity Spreadsheet -- Enzyme Inhibition Constant Data from BindingDB
Found 1 hit for monomerid = 23280
TargetBotulinum neurotoxin type A2 [1-425](Clostridium botulinum)
The Scripps Research Institute
LigandPNGBDBM23280(6-chloro-N-hydroxy-1H-indene-2-carboxamide | hydro...)
Affinity DataIC50:  4.10E+4nMpH: 7.4 T: 2°C. Assay description: Recombinant BoNT LC/A activity was measured in black 96-well microtiter plates by use of a Molecular Devices (Sunnyvale, CA) SpectraMax GeminiEM plat...
Ligand InfoPC cidPC sid
In DepthDetails ArticlePubMed