BDBM23295 (2E)-3-(4-chlorophenyl)-N-hydroxyprop-2-enamide::4-chlorocinnamic hydroxamate, 1
SMILES ONC(=O)\C=C\c1ccc(Cl)cc1
InChI Key InChIKey=YPYUWBDOEMPXSK-ZZXKWVIFSA-N
Data  2 IC50
PDB links: 1 PDB ID matches this monomer.
  Tab Delimited (TSV)   2D SDfile   Computed 3D by Vconf -m prep SDfile
Find this compound or compounds like it in BindingDB:
Activity Spreadsheet -- Enzyme Inhibition Constant Data from BindingDB
Found 2 hits for monomerid = 23295
TargetBotulinum neurotoxin type A(Clostridium botulinum)
Stony Brook University
Curated by ChEMBL
LigandPNGBDBM23295((2E)-3-(4-chlorophenyl)-N-hydroxyprop-2-enamide | ...)
Affinity DataIC50:  1.50E+4nM. Assay description: Inhibition of protease activity of Clostridium botulinum BoNT/A using SNAP-25 as substrate by FRET analysis
TargetBotulinum neurotoxin type A2 [1-425](Clostridium botulinum)
The Scripps Research Institute
LigandPNGBDBM23295((2E)-3-(4-chlorophenyl)-N-hydroxyprop-2-enamide | ...)
Affinity DataIC50:  1.50E+4nMpH: 7.4 T: 2°C. Assay description: Recombinant BoNT LC/A activity was measured in black 96-well microtiter plates by use of a Molecular Devices (Sunnyvale, CA) SpectraMax GeminiEM plat...