BDBM234242 US9346821, A-21
SMILES CC(C)N(Cc1ccc(o1)C(=O)Oc1ccc(cc1)C(N)=N)C(=O)N[C@@H](CC(O)=O)C(O)=O
InChI Key InChIKey=YYQRIFRFLPLJFF-HNNXBMFYSA-N
Data  2 KI
  Tab Delimited (TSV)   2D SDfile   Computed 3D by Vconf -m prep SDfile
Find this compound or compounds like it in BindingDB:
Activity Spreadsheet -- Enzyme Inhibition Constant Data from BindingDB
Found 2 hits for monomerid = 234242
TargetEnteropeptidase(Homo sapiens (Human))
Ajinomoto
US Patent
LigandPNGBDBM234242(US9346821, A-21)
Affinity DataKi:  0.380nMpH: 8.0Assay Description:Using a 96 well plate (#3915, Costar), a test compound (25 μL) was mixed with 20 μM fluorescence enzyme substrate (Boc-Phe-Ser-Arg-AMC, 50 ...
Ligand InfoKEGGPC cidPC sid
In DepthDetails US Patent
TargetSerine protease 1(Homo sapiens (Human))
Ajinomoto
US Patent
LigandPNGBDBM234242(US9346821, A-21)
Affinity DataKi:  0.840nMpH: 8.0Assay Description:Using a 96 well plate (#3915, Costar), a test compound (25 μL), 400 mM Tris-HCl buffer (pH 8.0, 25 μL) and 0.5 mg/mL fluorescence enzyme su...
Ligand InfoKEGGPC cidPC sid
In DepthDetails US Patent