BDBM234249 US9346821, B-18
SMILES NC(=N)c1ccc(OC(=O)c2ccc(CN3CCCC[C@H]3C(=O)N[C@@H](CC(O)=O)C(O)=O)s2)c(F)c1
InChI Key InChIKey=IMLFZOQSBRIKFR-HOTGVXAUSA-N
Data  2 KI
  Tab Delimited (TSV)   2D SDfile   Computed 3D by Vconf -m prep SDfile
Find this compound or compounds like it in BindingDB:
Activity Spreadsheet -- Enzyme Inhibition Constant Data from BindingDB
Found 2 hits for monomerid = 234249
TargetEnteropeptidase(Homo sapiens (Human))
Ajinomoto
US Patent
LigandPNGBDBM234249(US9346821, B-18)
Affinity DataKi:  0.440nMpH: 8.0Assay Description:Using a 96 well plate (#3915, Costar), a test compound (25 μL) was mixed with 20 μM fluorescence enzyme substrate (Boc-Phe-Ser-Arg-AMC, 50 ...
Ligand InfoKEGGPC cidPC sid
In DepthDetails US Patent
TargetSerine protease 1(Homo sapiens (Human))
Ajinomoto
US Patent
LigandPNGBDBM234249(US9346821, B-18)
Affinity DataKi:  0.920nMpH: 8.0Assay Description:Using a 96 well plate (#3915, Costar), a test compound (25 μL), 400 mM Tris-HCl buffer (pH 8.0, 25 μL) and 0.5 mg/mL fluorescence enzyme su...
Ligand InfoKEGGPC cidPC sid
In DepthDetails US Patent