BDBM234384 2-Chloro-10-(2-N,N-Dimethylaminoethoxy)-5-Thia-4-b-azaindeno[2,1-a]indene-5,5-Dioxide (8c)
SMILES CN(C)CCOc1c2-c3ccccc3S(=O)(=O)n2c2ccc(Cl)cc12
InChI Key InChIKey=GAHWCIAVGDUDLI-UHFFFAOYSA-N
Data  1 KI
  Tab Delimited (TSV)   2D SDfile   Computed 3D by Vconf -m prep SDfile
Find this compound or compounds like it in BindingDB:
Activity Spreadsheet -- Enzyme Inhibition Constant Data from BindingDB
Found 1 hit for monomerid = 234384
Target5-hydroxytryptamine receptor 6(Homo sapiens (Human))
Suven Life Sciences
LigandPNGBDBM234384(2-Chloro-10-(2-N,N-Dimethylaminoethoxy)-5-Thia-4-b...)
Affinity DataKi:  464nM ΔG°:  -8.98kcal/molepH: 7.4 T: 2°C. Assay description: Briefly, receptor source and radioligand used were human recombinant expressed in HEK-293 cells and [3H] LSD (60–80 Ci/mmol), respectively. The ...
Ligand InfoPC cidPC sid
In DepthDetails ArticlePubMed