BDBM234536 US9353089, 228
SMILES N=C1NC(C(=O)N1C1CCCCC1)(c1ccccc1)c1cccc(OCc2ccccc2)c1
InChI Key InChIKey=TYBFTJKZYITHTP-UHFFFAOYSA-N
Data  1 IC50
  Tab Delimited (TSV)   2D SDfile   Computed 3D by Vconf -m prep SDfile
Find this compound or compounds like it in BindingDB:
Activity Spreadsheet -- Enzyme Inhibition Constant Data from BindingDB
Found 1 hit for monomerid = 234536
TargetPlasmepsin II(Plasmodium falciparum)
Saint Louis University
US Patent
LigandPNGBDBM234536(US9353089, 228)
Affinity DataIC50:  2.89nMpH: 4.5 T: 2°C. Assay description: Plasmepsin-2 (PM-2; Plm II) and Plasmepsin (PM-4; Plm IV) expression and purification was performed following the published protocols (Istvan E S and...
Ligand InfoPC cidPC sid
In DepthDetails US Patent