BDBM234547 US9353089, 304
SMILES COc1ccc(cc1)C1(NC(=N)N(Cc2ccccc2C(F)(F)F)C1=O)c1ccc(OC)cc1
InChI Key InChIKey=QKNXBMHZKKVEFL-UHFFFAOYSA-N
Data  1 IC50
  Tab Delimited (TSV)   2D SDfile   Computed 3D by Vconf -m prep SDfile
Find this compound or compounds like it in BindingDB:
Activity Spreadsheet -- Enzyme Inhibition Constant Data from BindingDB
Found 1 hit for monomerid = 234547
TargetPlasmepsin II(Plasmodium falciparum)
Saint Louis University
US Patent
LigandPNGBDBM234547(US9353089, 304)
Affinity DataIC50:  1.88nMpH: 4.5 T: 2°C. Assay description: Plasmepsin-2 (PM-2; Plm II) and Plasmepsin (PM-4; Plm IV) expression and purification was performed following the published protocols (Istvan E S and...
Ligand InfoPC cidPC sid
In DepthDetails US Patent