BDBM234845 US9353116, 1
SMILES CC(C)n1nc(-c2cccc(NC(=O)C=C)c2)c2c(N)ncnc12
InChI Key InChIKey=VLYKSGQVQJLMOZ-UHFFFAOYSA-N
Data  2 IC50
  Tab Delimited (TSV)   2D SDfile   Computed 3D by Vconf -m prep SDfile
Find this compound or compounds like it in BindingDB:
Activity Spreadsheet -- Enzyme Inhibition Constant Data from BindingDB
Found 2 hits for monomerid = 234845
TargetProto-oncogene tyrosine-protein kinase Src [251-533,T338C](Gallus gallus (Chicken))
The Regents of The University of California
US Patent
LigandPNGBDBM234845(US9353116, 1)
Affinity DataIC50:  419nMpH: 8.0Assay Description:In vitro kinase assays for c-Src variants were performed in 50 mM Tris (pH 8.0), 10 mM MgCl2 and 1 mg/mL BSA. When obtaining kinetic parameters (kcat...
Ligand InfoPC cidPC sid
In DepthDetails US Patent
TargetProto-oncogene tyrosine-protein kinase Src [251-533](Gallus gallus (Chicken))
The Regents of The University of California
US Patent
LigandPNGBDBM234845(US9353116, 1)
Affinity DataIC50:  2.32E+3nMpH: 8.0Assay Description:In vitro kinase assays for c-Src variants were performed in 50 mM Tris (pH 8.0), 10 mM MgCl2 and 1 mg/mL BSA. When obtaining kinetic parameters (kcat...
Ligand InfoPC cidPC sid
In DepthDetails US Patent