BDBM24305 Letrozole derivative, 34::{2-chloro-4-[(4-cyanophenyl)(1H-1,2,4-triazol-1-yl)methyl]phenyl} sulfamate
SMILES NS(=O)(=O)Oc1ccc(cc1Cl)C(c1ccc(cc1)C#N)n1cncn1
InChI Key InChIKey=KFYVHFCQRAUDFM-UHFFFAOYSA-N
Data  2 IC50
  Tab Delimited (TSV)   2D SDfile   Computed 3D by Vconf -m prep SDfile
Find this compound or compounds like it in BindingDB:
Activity Spreadsheet -- Enzyme Inhibition Constant Data from BindingDB
Found 2 hits for monomerid = 24305
TargetSteryl-sulfatase(Homo sapiens (Human))
University of Bath
LigandPNGBDBM24305(Letrozole derivative, 34 | {2-chloro-4-[(4-cyanoph...)
Affinity DataIC50:  920nMpH: 7.5 T: 2°C. Assay description: The extent of in vitro inhibition of sulfatase activities was assessed using intact monolayers of JEG-3 cells. Sulfatase activity was measured using ...
In DepthDetails ArticlePubMed
TargetAromatase(Homo sapiens (Human))
University of Bath
LigandPNGBDBM24305(Letrozole derivative, 34 | {2-chloro-4-[(4-cyanoph...)
Affinity DataIC50:  12nMpH: 7.5 T: 2°C. Assay description: The extent of in vitro inhibition of aromatase activities was assessed using intact monolayers of JEG-3 cells. Aromatase activity was measured using ...
In DepthDetails ArticlePubMed