BDBM24308 Letrozole derivative, 40b S-(-)::{2-bromo-4-[(S)-(4-cyanophenyl)(1H-1,2,4-triazol-1-yl)methyl]phenyl} sulfamate
SMILES NS(=O)(=O)Oc1ccc(cc1Br)[C@H](c1ccc(cc1)C#N)n1cncn1
InChI Key InChIKey=SGRBZPZPWNVVPZ-INIZCTEOSA-N
Data  4 IC50
  Tab Delimited (TSV)   2D SDfile   Computed 3D by Vconf -m prep SDfile
Find this compound or compounds like it in BindingDB:
Activity Spreadsheet -- Enzyme Inhibition Constant Data from BindingDB
Found 4 hits for monomerid = 24308
TargetAromatase(Homo sapiens (Human))
University of Bath
LigandPNGBDBM24308(Letrozole derivative, 40b S-(-) | {2-bromo-4-[(S)-...)
Affinity DataIC50:  14.3nMpH: 7.5 T: 2°C. Assay description: The extent of in vitro inhibition of aromatase activities was assessed using intact monolayers of JEG-3 cells. Aromatase activity was measured using ...
In DepthDetails ArticlePubMed
TargetAromatase(Homo sapiens (Human))
University of Bath
LigandPNGBDBM24308(Letrozole derivative, 40b S-(-) | {2-bromo-4-[(S)-...)
Affinity DataIC50:  14nM. Assay description: Inhibition of aromatase (unknown origin) expressed in JEG-3 cells
In DepthDetails ArticlePubMed
TargetSteryl-sulfatase(Homo sapiens (Human))
University Of Bath
Curated by ChEMBL
LigandPNGBDBM24308(Letrozole derivative, 40b S-(-) | {2-bromo-4-[(S)-...)
Affinity DataIC50:  553nM. Assay description: Inhibition of STS activity (unknown origin) expressed in JEG-3 cells
In DepthDetails ArticlePubMed
TargetSteryl-sulfatase(Homo sapiens (Human))
University Of Bath
Curated by ChEMBL
LigandPNGBDBM24308(Letrozole derivative, 40b S-(-) | {2-bromo-4-[(S)-...)
Affinity DataIC50:  553nM. Assay description: The extent of in vitro inhibition of sulfatase activities was assessed using intact monolayers of JEG-3 cells. Sulfatase activity was measured using ...
In DepthDetails ArticlePubMed