BDBM249348 US10300060, Example 21-73::US10765676, Example 21-73::US9463192, 21-73::US9763943, 21-73::US9993479, 21-73
SMILES CN(C)c1ccn2ncc(-c3ccc(Oc4ncc(NC(=O)Nc5cc(ccc5-c5cccc(C)c5)C(F)(F)F)cn4)cc3)c2n1
InChI Key InChIKey=DCKIQNJDPQBOTQ-UHFFFAOYSA-N
Data  5 IC50
  Tab Delimited (TSV)   2D SDfile   Computed 3D by Vconf -m prep SDfile
Find this compound or compounds like it in BindingDB:
Activity Spreadsheet -- Enzyme Inhibition Constant Data from BindingDB
Found 5 hits for monomerid = 249348
TargetHigh affinity nerve growth factor receptor(Homo sapiens (Human))
Ono Pharmaceutical
US Patent
LigandPNGBDBM249348(US10300060, Example 21-73 | US10765676, Example 21...)
Affinity DataIC50:  3nMT: 2°C. Assay description: On the day before the assay, CellSenser TrkA-NFAT-bla CHO-K1 cells were suspended in an assay medium (Opti-MEM1 Reduced Serum Medium (Invitrogen) con...
Ligand InfoPC cidPC sid
In DepthDetails US Patent
TargetHigh affinity nerve growth factor receptor(Homo sapiens (Human))
Ono Pharmaceutical
US Patent
LigandPNGBDBM249348(US10300060, Example 21-73 | US10765676, Example 21...)
Affinity DataIC50:  3nM. Assay description: On the day before the assay, CellSenser TrkA-NFAT-bla CHO-K1 cells were suspended in an assay medium (Opti-MEM1 Reduced Serum Medium (Invitrogen) con...
Ligand InfoPC cidPC sid
In DepthDetails US Patent
TargetHigh affinity nerve growth factor receptor(Homo sapiens (Human))
Ono Pharmaceutical
US Patent
LigandPNGBDBM249348(US10300060, Example 21-73 | US10765676, Example 21...)
Affinity DataIC50:  3nM. Assay description: On the day before the assay, CellSenser TrkA-NFAT-bla CHO-K1 cells were suspended in an assay medium (Opti-MEM1 Reduced Serum Medium (Invitrogen) con...
Ligand InfoPC cidPC sid
In DepthDetails US Patent
TargetHigh affinity nerve growth factor receptor(Homo sapiens (Human))
Ono Pharmaceutical
US Patent
LigandPNGBDBM249348(US10300060, Example 21-73 | US10765676, Example 21...)
Affinity DataIC50:  3nM. Assay description: On the day before the assay, CellSenser™ TrkA-NFAT-b1a CHO-K1 cells were suspended in an assay medium (Opti-MEM1 Reduced Serum Medium (Invitrogen) co...
Ligand InfoPC cidPC sid
In DepthDetails US Patent
TargetHigh affinity nerve growth factor receptor(Homo sapiens (Human))
Ono Pharmaceutical
US Patent
LigandPNGBDBM249348(US10300060, Example 21-73 | US10765676, Example 21...)
Affinity DataIC50:  3nM. Assay description: TrkA kinase-inhibiting activity in cell systems was measured using CHO-K1 cells expressing human TrkA and NFAT-bla (CellSenser TrkA-NFAT-bla CHO-K1 c...
Ligand InfoPC cidPC sid
In DepthDetails US Patent