BDBM249355 US10300060, Example 23-12::US10765676, Example 23-12::US9463192, 23-12::US9763943, 23-12::US9993479, 23-12
SMILES FC(F)(F)c1ccc(c(NC(=O)Nc2cnc(Oc3ccc(cc3)-c3cnc4[nH]ncc4c3)nc2)c1)-c1cccnc1
InChI Key InChIKey=FBBVXRHXBBBOJS-UHFFFAOYSA-N
Data  5 IC50
  Tab Delimited (TSV)   2D SDfile   Computed 3D by Vconf -m prep SDfile
Find this compound or compounds like it in BindingDB:
Activity Spreadsheet -- Enzyme Inhibition Constant Data from BindingDB
Found 5 hits for monomerid = 249355
TargetHigh affinity nerve growth factor receptor(Homo sapiens (Human))
Ono Pharmaceutical
US Patent
LigandPNGBDBM249355(US10300060, Example 23-12 | US10765676, Example 23...)
Affinity DataIC50:  1nMT: 2°C. Assay description: On the day before the assay, CellSenser TrkA-NFAT-bla CHO-K1 cells were suspended in an assay medium (Opti-MEM1 Reduced Serum Medium (Invitrogen) con...
Ligand InfoPC cidPC sid
In DepthDetails US Patent
TargetHigh affinity nerve growth factor receptor(Homo sapiens (Human))
Ono Pharmaceutical
US Patent
LigandPNGBDBM249355(US10300060, Example 23-12 | US10765676, Example 23...)
Affinity DataIC50:  1nM. Assay description: On the day before the assay, CellSenser TrkA-NFAT-bla CHO-K1 cells were suspended in an assay medium (Opti-MEM1 Reduced Serum Medium (Invitrogen) con...
Ligand InfoPC cidPC sid
In DepthDetails US Patent
TargetHigh affinity nerve growth factor receptor(Homo sapiens (Human))
Ono Pharmaceutical
US Patent
LigandPNGBDBM249355(US10300060, Example 23-12 | US10765676, Example 23...)
Affinity DataIC50:  1nM. Assay description: On the day before the assay, CellSenser TrkA-NFAT-bla CHO-K1 cells were suspended in an assay medium (Opti-MEM1 Reduced Serum Medium (Invitrogen) con...
Ligand InfoPC cidPC sid
In DepthDetails US Patent
TargetHigh affinity nerve growth factor receptor(Homo sapiens (Human))
Ono Pharmaceutical
US Patent
LigandPNGBDBM249355(US10300060, Example 23-12 | US10765676, Example 23...)
Affinity DataIC50:  1nM. Assay description: On the day before the assay, CellSenser™ TrkA-NFAT-b1a CHO-K1 cells were suspended in an assay medium (Opti-MEM1 Reduced Serum Medium (Invitrogen) co...
Ligand InfoPC cidPC sid
In DepthDetails US Patent
TargetHigh affinity nerve growth factor receptor(Homo sapiens (Human))
Ono Pharmaceutical
US Patent
LigandPNGBDBM249355(US10300060, Example 23-12 | US10765676, Example 23...)
Affinity DataIC50:  1nM. Assay description: TrkA kinase-inhibiting activity in cell systems was measured using CHO-K1 cells expressing human TrkA and NFAT-bla (CellSenser TrkA-NFAT-bla CHO-K1 c...
Ligand InfoPC cidPC sid
In DepthDetails US Patent