BDBM250666 US9447148, 9.35::US9447148, 9.48
SMILES CCCC[C@H](NC(C)=O)C(=O)N[C@H]1CCC(=O)NCC[C@H](NC(=O)[C@H](C)NC(=O)[C@@H](Cc2ccccc2)NC(=O)[C@H](Cc2c[nH]cn2)NC1=O)C(=O)N[C@@H](Cc1c[nH]c2ccccc12)C(N)=O
InChI Key
Data  4 KI  2 EC50
  Tab Delimited (TSV)   2D SDfile   Computed 3D by Vconf -m prep SDfile
Find this compound or compounds like it in BindingDB:
Activity Spreadsheet -- Enzyme Inhibition Constant Data from BindingDB
Found 6 hits for monomerid = 250666
TargetMelanocyte-stimulating hormone receptor(Homo sapiens (Human))
Palatin Technologies
US Patent
LigandPNGBDBM250666(US9447148, 9.35 | US9447148, 9.48)
Affinity DataKi:  0.800nM ΔG°:  -12.9kcal/molepH: 7.5 T: 2°C. Assay description: A competitive inhibition binding assay was performed using membrane homogenates prepared from HEK-293 cells that express recombinant hMCR-1a or hMCR-...
Ligand InfoPC cidPC sid
In DepthDetails US Patent
TargetMelanocyte-stimulating hormone receptor(Homo sapiens (Human))
Palatin Technologies
US Patent
LigandPNGBDBM250666(US9447148, 9.35 | US9447148, 9.48)
Affinity DataKi:  0.800nM ΔG°:  -12.9kcal/molepH: 7.5 T: 2°C. Assay description: A competitive inhibition binding assay was performed using membrane homogenates prepared from HEK-293 cells that express recombinant hMCR-1a or hMCR-...
Ligand InfoPC cidPC sid
In DepthDetails US Patent
TargetMelanocortin receptor 4(Homo sapiens (Human))
Palatin Technologies
US Patent
LigandPNGBDBM250666(US9447148, 9.35 | US9447148, 9.48)
Affinity DataKi:  1.00E+4nM ΔG°:  -7.09kcal/molepH: 7.5 T: 2°C. Assay description: A competitive inhibition binding assay was performed using membrane homogenates prepared from HEK-293 cells that express recombinant hMCR-1a or hMCR-...
Ligand InfoPC cidPC sid
In DepthDetails US Patent
TargetMelanocortin receptor 4(Homo sapiens (Human))
Palatin Technologies
US Patent
LigandPNGBDBM250666(US9447148, 9.35 | US9447148, 9.48)
Affinity DataKi:  1.00E+4nM ΔG°:  -7.09kcal/molepH: 7.5 T: 2°C. Assay description: A competitive inhibition binding assay was performed using membrane homogenates prepared from HEK-293 cells that express recombinant hMCR-1a or hMCR-...
Ligand InfoPC cidPC sid
In DepthDetails US Patent
TargetMelanocyte-stimulating hormone receptor(Homo sapiens (Human))
Palatin Technologies
US Patent
LigandPNGBDBM250666(US9447148, 9.35 | US9447148, 9.48)
Affinity DataEC50:  0.115nMpH: 7.5 T: 2°C. Assay description: Accumulation of intracellular cAMP was examined as a measure of the ability of the peptides of the present invention to elicit a functional response ...
Ligand InfoPC cidPC sid
In DepthDetails US Patent
TargetMelanocyte-stimulating hormone receptor(Homo sapiens (Human))
Palatin Technologies
US Patent
LigandPNGBDBM250666(US9447148, 9.35 | US9447148, 9.48)
Affinity DataEC50:  0.115nMpH: 7.5 T: 2°C. Assay description: Accumulation of intracellular cAMP was examined as a measure of the ability of the peptides of the present invention to elicit a functional response ...
Ligand InfoPC cidPC sid
In DepthDetails US Patent