BDBM259376 US9505745, 53::US9790212, Example 53
SMILES CCN(C1CCOCC1)c1sc(Cl)c(C(=O)NCc2c(C)cc(C)[nH]c2=O)c1C
InChI Key InChIKey=VPWRXOUDVYAELQ-UHFFFAOYSA-N
Data  2 IC50
  Tab Delimited (TSV)   2D SDfile   Computed 3D by Vconf -m prep SDfile
Find this compound or compounds like it in BindingDB:
Activity Spreadsheet -- Enzyme Inhibition Constant Data from BindingDB
Found 2 hits for monomerid = 259376
LigandPNGBDBM259376(US9505745, 53 | US9790212, Example 53)
Affinity DataIC50:  16nM. Assay description: Compounds contained herein were evaluated for their ability to inhibit the methyltransferase activity of EZH2 within the PRC2 complex. Human PRC2 com...
Ligand InfoPC cidPC sid
In DepthDetails US Patent
LigandPNGBDBM259376(US9505745, 53 | US9790212, Example 53)
Affinity DataIC50:  16nM. Assay description: Protocol 2: Compounds contained herein were evaluated for their ability to inhibit the methyltransferase activity of EZH2 within the PRC2 complex. Hu...
Ligand InfoPC cidPC sid
In DepthDetails US Patent