BDBM259944 US9512121, 28
SMILES Cn1cc(cn1)-c1ccc2nnc(Sc3ccc4ncc(N5CCOCC5)c(F)c4c3)n2c1
InChI Key InChIKey=BNNNQQWVQQQCBD-UHFFFAOYSA-N
Data  1 IC50
  Tab Delimited (TSV)   2D SDfile   Computed 3D by Vconf -m prep SDfile
Find this compound or compounds like it in BindingDB:
Activity Spreadsheet -- Enzyme Inhibition Constant Data from BindingDB
Found 1 hit for monomerid = 259944
TargetHepatocyte growth factor receptor(Homo sapiens (Human))
Jiangsu Hansoh Pharmaceutical
US Patent
LigandPNGBDBM259944(US9512121, 28)
Affinity DataIC50:  3.60nMT: 2°C. Assay description: Experimental Purpose: The purpose is to study the effect of the compounds on c-MET tyrosine kinase activity at the molecular level. IC50 values were ...
Ligand InfoPC cidPC sid
In DepthDetails US Patent