BDBM261605 US10513499, Compound 16::US11254644, Compound 16::US9708272, 16
SMILES OC(=O)c1ccc(CSc2nc(-c3ccccc3)c(C#N)c(=O)[nH]2)cc1
InChI Key InChIKey=DALBJAQPFUGPCJ-UHFFFAOYSA-N
Data  3 IC50
  Tab Delimited (TSV)   2D SDfile   Computed 3D by Vconf -m prep SDfile
Find this compound or compounds like it in BindingDB:
Activity Spreadsheet -- Enzyme Inhibition Constant Data from BindingDB
Found 3 hits for monomerid = 261605
Target2-amino-3-carboxymuconate-6-semialdehyde decarboxylase(Homo sapiens (Human))
Tes Pharma
US Patent
LigandPNGBDBM261605(US10513499, Compound 16 | US11254644, Compound 16 ...)
Affinity DataIC50:  110nM. Assay description: The pre-assay mixture consisting of 3-hydroxyanthranilic acid (3OH-HA), 3-hydroxyanthranilic acid, 3,4-diOxygenase (HAO), and a dialyzed crude extrac...
In DepthDetails US Patent
Target2-amino-3-carboxymuconate-6-semialdehyde decarboxylase(Homo sapiens (Human))
Tes Pharma
US Patent
LigandPNGBDBM261605(US10513499, Compound 16 | US11254644, Compound 16 ...)
Affinity DataIC50:  110nM. Assay description: The activity of compounds 1-19 and 21-23 as inhibitors of ACMSD1 was determined by measuring the conversion of 3OH-Anthranilic Acid into product (i.e...
In DepthDetails US Patent
Target2-amino-3-carboxymuconate-6-semialdehyde decarboxylase(Homo sapiens (Human))
Tes Pharma
US Patent
LigandPNGBDBM261605(US10513499, Compound 16 | US11254644, Compound 16 ...)
Affinity DataIC50:  110nM. Assay description: The pre-assay mixture consisting of 3-hydroxyanthranilic acid (30H-HA), 3-hydroxyanthranilic acid, 3,4-diOxygenase (HAO), and a dialyzed crude extrac...
In DepthDetails US Patent