BDBM263593 US10087181, Compound 68::US10285988, Compound 68::US9713612, 68
SMILES Cc1cc(ccn1)-c1ccc(CNc2nccc3cc(ccc23)-c2ccnnc2)cc1
InChI Key InChIKey=BWFISJWWHRIZQC-UHFFFAOYSA-N
Data  3 IC50
  Tab Delimited (TSV)   2D SDfile   Computed 3D by Vconf -m prep SDfile
Find this compound or compounds like it in BindingDB:
Activity Spreadsheet -- Enzyme Inhibition Constant Data from BindingDB
Found 3 hits for monomerid = 263593
TargetProtein Wnt-3a(Homo sapiens (Human))
Curegenix
US Patent
LigandPNGBDBM263593(US10087181, Compound 68 | US10285988, Compound 68 ...)
Affinity DataIC50:  25nM. Assay description: Materials and Methods: NIH3T3 mouse fibroblast cells (American Type Culture Collection, Manassas, Va.) were transfected with a plasmid containing a l...
Ligand InfoPC cidPC sid
In DepthDetails US Patent
TargetProtein Wnt-3a(Homo sapiens (Human))
Curegenix
US Patent
LigandPNGBDBM263593(US10087181, Compound 68 | US10285988, Compound 68 ...)
Affinity DataIC50:  25nM. Assay description: Materials and Methods: NIH3T3 mouse fibroblast cells (American Type Culture Collection, Manassas, Va.) were transfected with a plasmid containing a l...
Ligand InfoPC cidPC sid
In DepthDetails US Patent
TargetProtein Wnt-3a(Homo sapiens (Human))
Curegenix
US Patent
LigandPNGBDBM263593(US10087181, Compound 68 | US10285988, Compound 68 ...)
Affinity DataIC50:  25nM. Assay description: NIH3T3 mouse fibroblast cells (American Type Culture Collection, Manassas, Va.) were transfected with a plasmid containing a luciferase gene driven b...
Ligand InfoPC cidPC sid
In DepthDetails US Patent