BDBM269897 (1R,2S)-1-(5-chloropyrimidin-2-yl)-N-(4-(2,6-dimethoxyphenyl)-5-(5-methylpyridin-3-yl)-4H-1,2,4-triazol-3-yl)-1-ethoxypropane-2-sulfonamide::US10058550, Example 429.0::US10221162, Example 610.0::US9845310, Example 610.0
SMILES CCO[C@@H]([C@H](C)S(=O)(=O)Nc1nnc(-c2cncc(C)c2)n1-c1c(OC)cccc1OC)c1ncc(Cl)cn1
InChI Key InChIKey=IVVDMYRWRKJRSC-AOMKIAJQSA-N
Data  5 EC50
  Tab Delimited (TSV)   2D SDfile   Computed 3D by Vconf -m prep SDfile
Find this compound or compounds like it in BindingDB:
Activity Spreadsheet -- Enzyme Inhibition Constant Data from BindingDB
Found 5 hits for monomerid = 269897
TargetApelin receptor(Homo sapiens (Human))
Amgen
US Patent
LigandPNGBDBM269897((1R,2S)-1-(5-chloropyrimidin-2-yl)-N-(4-(2,6-dimet...)
Affinity DataEC50:  0.270nMpH: 7.5Assay Description:The human APJ receptor was cloned by polymerase chain reaction and the gene encoding the receptor was subcloned in pFLAG-CMV¿-3 expression vector (Si...
Ligand InfoPC cidPC sid
In DepthDetails US Patent
TargetApelin receptor(Homo sapiens (Human))
Amgen
US Patent
LigandPNGBDBM269897((1R,2S)-1-(5-chloropyrimidin-2-yl)-N-(4-(2,6-dimet...)
Affinity DataEC50:  0.270nM. Assay description: The human APJ receptor was cloned by polymerase chain reaction and the gene encoding the receptor was subcloned in pFLAG-CMV™-3 expression vector (Si...
Ligand InfoPC cidPC sid
In DepthDetails US Patent
TargetApelin receptor(Homo sapiens (Human))
Amgen
US Patent
LigandPNGBDBM269897((1R,2S)-1-(5-chloropyrimidin-2-yl)-N-(4-(2,6-dimet...)
Affinity DataEC50:  0.300nM. Assay description: The human APJ receptor was cloned by polymerase chain reaction and the gene encoding the receptor was subcloned in pFLAG-CMV-3 expression vector (Sig...
Ligand InfoPC cidPC sid
In DepthDetails US Patent
TargetApelin receptor(Homo sapiens (Human))
Amgen
US Patent
LigandPNGBDBM269897((1R,2S)-1-(5-chloropyrimidin-2-yl)-N-(4-(2,6-dimet...)
Affinity DataEC50:  0.270nM. Assay description: The human APJ receptor was cloned by polymerase chain reaction and the gene encoding the receptor was subcloned in pFLAG-CMV-3 expression vector (Sig...
Ligand InfoPC cidPC sid
In DepthDetails US Patent
TargetApelin receptor(Homo sapiens (Human))
Amgen
US Patent
LigandPNGBDBM269897((1R,2S)-1-(5-chloropyrimidin-2-yl)-N-(4-(2,6-dimet...)
Affinity DataEC50:  0.300nM. Assay description: The human APJ receptor was cloned by polymerase chain reaction and the gene encoding the receptor was subcloned in pFLAG-CMV™-3 expression vector (Si...
Ligand InfoPC cidPC sid
In DepthDetails US Patent