BDBM269916 (2S,3R)—N-(4-(4,6-dimethoxy-5-pyrimidinyl)-5-(5-methyl-3-pyridinyl)-4H-1,2,4-triazol-3-yl)-3-(5-fluoro-2-pyrimidinyl)-2-butanesulfonamide and (2R,3S)—N-(4-(4,6-dimethoxy-5-pyrimidinyl)-5-(5-methyl-3-pyridinyl)-4H-1,2,4-triazol-3-yl)-3-(5-fluoro-2-pyrimidinyl)-2-butanesulfonamide::US10058550, Example 449.0::US10221162, Example 450.0::US9845310, Example 450.0
SMILES COc1ncnc(OC)c1-n1c(NS(=O)(=O)[C@@H](C)[C@H](C)c2ncc(F)cn2)nnc1-c1cncc(C)c1
InChI Key InChIKey=PJQRUQJHUYHSMJ-KBPBESRZSA-N
Data  5 EC50
  Tab Delimited (TSV)   2D SDfile   Computed 3D by Vconf -m prep SDfile
Find this compound or compounds like it in BindingDB:
Activity Spreadsheet -- Enzyme Inhibition Constant Data from BindingDB
Found 5 hits for monomerid = 269916
TargetApelin receptor(Homo sapiens (Human))
Amgen
US Patent
LigandPNGBDBM269916((2S,3R)—N-(4-(4,6-dimethoxy-5-pyrimidinyl)-5-...)
Affinity DataEC50:  4.90nMpH: 7.5Assay Description:The human APJ receptor was cloned by polymerase chain reaction and the gene encoding the receptor was subcloned in pFLAG-CMV¿-3 expression vector (Si...
Ligand InfoPC cidPC sid
In DepthDetails US Patent
TargetApelin receptor(Homo sapiens (Human))
Amgen
US Patent
LigandPNGBDBM269916((2S,3R)—N-(4-(4,6-dimethoxy-5-pyrimidinyl)-5-...)
Affinity DataEC50:  4.90nM. Assay description: The human APJ receptor was cloned by polymerase chain reaction and the gene encoding the receptor was subcloned in pFLAG-CMV™-3 expression vector (Si...
Ligand InfoPC cidPC sid
In DepthDetails US Patent
TargetApelin receptor(Homo sapiens (Human))
Amgen
US Patent
LigandPNGBDBM269916((2S,3R)—N-(4-(4,6-dimethoxy-5-pyrimidinyl)-5-...)
Affinity DataEC50:  3.20nM. Assay description: The human APJ receptor was cloned by polymerase chain reaction and the gene encoding the receptor was subcloned in pFLAG-CMV-3 expression vector (Sig...
Ligand InfoPC cidPC sid
In DepthDetails US Patent
TargetApelin receptor(Homo sapiens (Human))
Amgen
US Patent
LigandPNGBDBM269916((2S,3R)—N-(4-(4,6-dimethoxy-5-pyrimidinyl)-5-...)
Affinity DataEC50:  4.90nM. Assay description: The human APJ receptor was cloned by polymerase chain reaction and the gene encoding the receptor was subcloned in pFLAG-CMV-3 expression vector (Sig...
Ligand InfoPC cidPC sid
In DepthDetails US Patent
TargetApelin receptor(Homo sapiens (Human))
Amgen
US Patent
LigandPNGBDBM269916((2S,3R)—N-(4-(4,6-dimethoxy-5-pyrimidinyl)-5-...)
Affinity DataEC50:  3.20nM. Assay description: The human APJ receptor was cloned by polymerase chain reaction and the gene encoding the receptor was subcloned in pFLAG-CMV™-3 expression vector (Si...
Ligand InfoPC cidPC sid
In DepthDetails US Patent