BDBM27575 5-[(5-chloro-3-methyl-1H-indazol-4-yl)oxy]benzene-1,3-dicarbonitrile::Indazole Derivative, 5
SMILES Cc1n[nH]c2ccc(Cl)c(Oc3cc(cc(c3)C#N)C#N)c12
InChI Key InChIKey=VXGYYFMKSYJDOH-UHFFFAOYSA-N
Data  1 IC50
  Tab Delimited (TSV)   2D SDfile   Computed 3D by Vconf -m prep SDfile
Find this compound or compounds like it in BindingDB:
Activity Spreadsheet -- Enzyme Inhibition Constant Data from BindingDB
Found 1 hit for monomerid = 27575
TargetGag-Pol polyprotein [588-1027](Human immunodeficiency virus type 1 group M subtyp...)
Pfizer
LigandPNGBDBM27575(5-[(5-chloro-3-methyl-1H-indazol-4-yl)oxy]benzene-...)
Affinity DataIC50:  399nMpH: 7.8 T: 2°C. Assay description: The inhibition of the RNA-dependent DNA polymerase activity of the HIV-1 reverse transcriptase enzyme was measured using a primer extension assay. Th...
In DepthDetails ArticlePubMed