BDBM276841 US10072001, Example 27::US10259811, Example 27
SMILES CC(O)C(=O)N1CC[C@H](C1)Oc1ccc(cc1C#N)-c1ccnc2[nH]c(cc12)-c1ccc(cc1)N1CCOCC1
InChI Key InChIKey=ZTZIUAYGMJBGIE-GBAXHLBXSA-N
Data  4 IC50
  Tab Delimited (TSV)   2D SDfile   Computed 3D by Vconf -m prep SDfile
Find this compound or compounds like it in BindingDB:
Activity Spreadsheet -- Enzyme Inhibition Constant Data from BindingDB
Found 4 hits for monomerid = 276841
TargetInhibitor of nuclear factor kappa-B kinase subunit epsilon(Homo sapiens (Human))
Gilead Sciences
US Patent
LigandPNGBDBM276841(US10072001, Example 27 | US10259811, Example 27)
Affinity DataIC50:  13.4nMpH: 7.0Assay Description:Enzymatic activity of IKKε and TBK1 was measured using a homogeneous time resolved fluorescence resonance energy transfer (TR-FRET) assay that m...
Ligand InfoPC cidPC sid
In DepthDetails US Patent
TargetSerine/threonine-protein kinase TBK1(Homo sapiens (Human))
Gilead Sciences
US Patent
LigandPNGBDBM276841(US10072001, Example 27 | US10259811, Example 27)
Affinity DataIC50:  6.54nM. Assay description: Enzymatic activity of IKKε and TBK1 was measured using a homogeneous time resolved fluorescence resonance energy transfer (TR-FRET) assay that m...
Ligand InfoPC cidPC sid
In DepthDetails US Patent
TargetInhibitor of nuclear factor kappa-B kinase subunit epsilon(Homo sapiens (Human))
Gilead Sciences
US Patent
LigandPNGBDBM276841(US10072001, Example 27 | US10259811, Example 27)
Affinity DataIC50:  13.4nM. Assay description: Enzymatic activity of IKKε and TBK1 was measured using a homogeneous time resolved fluorescence resonance energy transfer (TR-FRET) assay that m...
Ligand InfoPC cidPC sid
In DepthDetails US Patent
TargetSerine/threonine-protein kinase TBK1(Homo sapiens (Human))
Gilead Sciences
US Patent
LigandPNGBDBM276841(US10072001, Example 27 | US10259811, Example 27)
Affinity DataIC50:  6.54nMpH: 7.0Assay Description:Enzymatic activity of IKKε and TBK1 was measured using a homogeneous time resolved fluorescence resonance energy transfer (TR-FRET) assay that m...
Ligand InfoPC cidPC sid
In DepthDetails US Patent