BDBM28139 methyl (2S)-2-[(2R)-7-chloro-1H,2H,3H,4H-cyclopenta[b]indol-2-yl]-2-fluoro-2-[(3-methoxybenzene)sulfonyl]acetate::tetrahydro-cyclopenta[b]indole, (+/-)19
SMILES [H][C@@]1(Cc2[nH]c3ccc(Cl)cc3c2C1)[C@@](F)(C(=O)OC)S(=O)(=O)c1cccc(OC)c1
InChI Key InChIKey=MBYSDJHWBSSHJB-GTJPDFRWSA-N
Data  2 IC50  2 EC50
  Tab Delimited (TSV)   2D SDfile   Computed 3D by Vconf -m prep SDfile
Find this compound or compounds like it in BindingDB:
Activity Spreadsheet -- Enzyme Inhibition Constant Data from BindingDB
Found 2 hits for monomerid = 28139
TargetOxysterols receptor LXR-beta(Homo sapiens (Human))
F. Hoffmann-La Roche
LigandPNGBDBM28139(methyl (2S)-2-[(2R)-7-chloro-1H,2H,3H,4H-cyclopent...)
Affinity DataIC50:  56nM EC50:  160nM. Assay description: LXR receptor binding assays were performed in 96-well plates. For each well reaction, GST-LXR-LBD fusion proteins were bound to SPA beads, and radiol...
In DepthDetails ArticlePubMed
TargetOxysterols receptor LXR-alpha(Homo sapiens (Human))
F. Hoffmann-La Roche
LigandPNGBDBM28139(methyl (2S)-2-[(2R)-7-chloro-1H,2H,3H,4H-cyclopent...)
Affinity DataIC50:  62nM EC50:  1.07E+3nMpH: 7.4 T: 2°C. Assay description: LXR receptor binding assays were performed in 96-well plates. For each well reaction, GST-LXR-LBD fusion proteins were bound to SPA beads, and radiol...
In DepthDetails ArticlePubMed