BDBM28146 (2S)-2-(benzenesulfonyl)-2-[(2R)-7-chloro-1H,2H,3H,4H-cyclopenta[b]indol-2-yl]-2-fluoro-N-methylacetamide::tetrahydro-cyclopenta[b]indole, (+/-)26a
SMILES [H][C@@]1(Cc2[nH]c3ccc(Cl)cc3c2C1)[C@@](F)(C(=O)NC)S(=O)(=O)c1ccccc1
InChI Key InChIKey=OESYIXZKTVZBJV-ODXCJYRJSA-N
Data  2 IC50  2 EC50
  Tab Delimited (TSV)   2D SDfile   Computed 3D by Vconf -m prep SDfile
Find this compound or compounds like it in BindingDB:
Activity Spreadsheet -- Enzyme Inhibition Constant Data from BindingDB
Found 2 hits for monomerid = 28146
TargetOxysterols receptor LXR-beta(Homo sapiens (Human))
F. Hoffmann-La Roche
LigandPNGBDBM28146((2S)-2-(benzenesulfonyl)-2-[(2R)-7-chloro-1H,2H,3H...)
Affinity DataIC50:  3.87E+3nM EC50:  400nM. Assay description: LXR receptor binding assays were performed in 96-well plates. For each well reaction, GST-LXR-LBD fusion proteins were bound to SPA beads, and radiol...
In DepthDetails ArticlePubMed
TargetOxysterols receptor LXR-alpha(Homo sapiens (Human))
F. Hoffmann-La Roche
LigandPNGBDBM28146((2S)-2-(benzenesulfonyl)-2-[(2R)-7-chloro-1H,2H,3H...)
Affinity DataIC50:  2.70E+3nM EC50:  1.55E+3nMpH: 7.4 T: 2°C. Assay description: LXR receptor binding assays were performed in 96-well plates. For each well reaction, GST-LXR-LBD fusion proteins were bound to SPA beads, and radiol...
In DepthDetails ArticlePubMed