BDBM28150 2-[(S)-(benzenesulfonyl)[(2R)-7-chloro-1H,2H,3H,4H-cyclopenta[b]indol-2-yl]fluoromethyl]-5-cyclopropyl-1,3,4-oxadiazole::tetrahydro-cyclopenta[b]indole, (+/-)27c
SMILES [H][C@@]1(Cc2[nH]c3ccc(Cl)cc3c2C1)[C@@](F)(c1nnc(o1)C1CC1)S(=O)(=O)c1ccccc1
InChI Key InChIKey=FDPTZOBGHHQMTN-FATZIPQQSA-N
Data  2 IC50  2 EC50
  Tab Delimited (TSV)   2D SDfile   Computed 3D by Vconf -m prep SDfile
Find this compound or compounds like it in BindingDB:
Activity Spreadsheet -- Enzyme Inhibition Constant Data from BindingDB
Found 2 hits for monomerid = 28150
TargetOxysterols receptor LXR-beta(Homo sapiens (Human))
F. Hoffmann-La Roche
LigandPNGBDBM28150(2-[(S)-(benzenesulfonyl)[(2R)-7-chloro-1H,2H,3H,4H...)
Affinity DataIC50:  83nM EC50:  92nM. Assay description: LXR receptor binding assays were performed in 96-well plates. For each well reaction, GST-LXR-LBD fusion proteins were bound to SPA beads, and radiol...
In DepthDetails ArticlePubMed
TargetOxysterols receptor LXR-alpha(Homo sapiens (Human))
F. Hoffmann-La Roche
LigandPNGBDBM28150(2-[(S)-(benzenesulfonyl)[(2R)-7-chloro-1H,2H,3H,4H...)
Affinity DataIC50:  290nM EC50:  430nMpH: 7.4 T: 2°C. Assay description: LXR receptor binding assays were performed in 96-well plates. For each well reaction, GST-LXR-LBD fusion proteins were bound to SPA beads, and radiol...
In DepthDetails ArticlePubMed