BDBM28153 methyl 5-[(S)-(benzenesulfonyl)[(2R)-7-chloro-1H,2H,3H,4H-cyclopenta[b]indol-2-yl]fluoromethyl]-1,2,4-oxadiazole-3-carboxylate::tetrahydro-cyclopenta[b]indole, (+/-)28b
SMILES [H][C@@]1(Cc2[nH]c3ccc(Cl)cc3c2C1)[C@@](F)(c1nc(no1)C(=O)OC)S(=O)(=O)c1ccccc1
InChI Key InChIKey=ZEJSYWOLUBDLES-IPQOISQHSA-N
Data  1 IC50  1 EC50
  Tab Delimited (TSV)   2D SDfile   Computed 3D by Vconf -m prep SDfile
Find this compound or compounds like it in BindingDB:
Activity Spreadsheet -- Enzyme Inhibition Constant Data from BindingDB
Found 1 hit for monomerid = 28153
TargetOxysterols receptor LXR-alpha(Homo sapiens (Human))
F. Hoffmann-La Roche
LigandPNGBDBM28153(methyl 5-[(S)-(benzenesulfonyl)[(2R)-7-chloro-1H,2...)
Affinity DataIC50:  1.63E+3nM EC50:  1.26E+3nMpH: 7.4 T: 2°C. Assay description: LXR receptor binding assays were performed in 96-well plates. For each well reaction, GST-LXR-LBD fusion proteins were bound to SPA beads, and radiol...
In DepthDetails ArticlePubMed