BDBM288005 US10087167, Compound 4014
SMILES [#6]-[#7]-[#6](=O)-c1c(oc2cc(-[#7](-[#6]-[#6]F)S([#6])(=O)=O)c(cc12)-c1cccc(c1)-[#6](=O)-[#7]-1-[#6]-[#6]\[#6](-[#6]-[#6]-1)=[#6](/C#N)-c1ccccn1)-c1ccc(F)cc1
InChI Key InChIKey=WUKLDBAFPMKHMU-UHFFFAOYSA-N
Data  1 EC50
  Tab Delimited (TSV)   2D SDfile   Computed 3D by Vconf -m prep SDfile
Find this compound or compounds like it in BindingDB:
Activity Spreadsheet -- Enzyme Inhibition Constant Data from BindingDB
Found 1 hit for monomerid = 288005
TargetGenome polyprotein(Hepatitis C virus (HCV))
Bristol-Myers Squibb
US Patent
LigandPNGBDBM288005(US10087167, Compound 4014)
Affinity DataEC50: <100nM. Assay description: To evaluate compound efficacy, titrated compounds were transferred to sterile 384-well tissue culture treated plates, and the plates were seeded with...
Ligand InfoPC cidPC sid
In DepthDetails US Patent