BDBM289052 5-(N-(6-chloro-3-(3-(4-chloro-3,5-dimethylphenoxy)propyl)-1H-indole-2-carbonyl)sulfamoyl)furan-2-carboxylic acid::US10093640, Example 261::US10844032, Example 261
SMILES Cc1cc(OCCCc2c([nH]c3cc(Cl)ccc23)C(=O)NS(=O)(=O)c2ccc(o2)C(O)=O)cc(C)c1Cl
InChI Key InChIKey=OJVRYPSPYYTBTR-UHFFFAOYSA-N
Data  1 KI  1 IC50
  Tab Delimited (TSV)   2D SDfile   Computed 3D by Vconf -m prep SDfile
Find this compound or compounds like it in BindingDB:
Activity Spreadsheet -- Enzyme Inhibition Constant Data from BindingDB
Found 2 hits for monomerid = 289052
TargetInduced myeloid leukemia cell differentiation protein Mcl-1 [172-327](Homo sapiens (Human))
Vanderbilt University
US Patent
LigandPNGBDBM289052(5-(N-(6-chloro-3-(3-(4-chloro-3,5-dimethylphenoxy)...)
Affinity DataKi: <100nM. Assay description: The assay was run using a fluorescein isothiocyanate-labeled BH3 peptide derived from Bak (FITC-AHx-GQVGRQLAIIGDDINR-NH2) that was purchased from Gen...
Ligand InfoPC cidPC sid
In DepthDetails US Patent
TargetInduced myeloid leukemia cell differentiation protein Mcl-1(Homo sapiens (Human))
Novartis
US Patent
LigandPNGBDBM289052(5-(N-(6-chloro-3-(3-(4-chloro-3,5-dimethylphenoxy)...)
Affinity DataIC50: <100nMpH: 7.5 T: 2°C. Assay description: Compound affinity was measured using a fluorescence polarization anisotropy competition assay. Anisotropy measurements were carried out in 384-well, ...
Ligand InfoPC cidPC sid
In DepthDetails US Patent