BDBM28916 2-mercaptoacetamide, 12b::N-[3-(2-chlorophenyl)-1H-pyrazol-5-yl]-2-sulfanylacetamide
SMILES SCC(=O)Nc1cc(n[nH]1)-c1ccccc1Cl
InChI Key InChIKey=LPVJDFOHQVRCRE-UHFFFAOYSA-N
Data  1 IC50
  Tab Delimited (TSV)   2D SDfile   Computed 3D by Vconf -m prep SDfile
Find this compound or compounds like it in BindingDB:
Activity Spreadsheet -- Enzyme Inhibition Constant Data from BindingDB
Found 1 hit for monomerid = 28916
TargetBotulinum neurotoxin type A2 [1-425](Clostridium botulinum)
Absolute Science
LigandPNGBDBM28916(2-mercaptoacetamide, 12b | N-[3-(2-chlorophenyl)-1...)
Affinity DataIC50:  2.60E+4nMpH: 7.4 T: 2°C. Assay description: Reactions between recombinant BoNTA-LC and fluorescent peptide substrate were carried out in 96-well microplates. Reaction progress was measured cont...
In DepthDetails ArticlePubMed