BDBM293046 US10106501, Example AA-35
SMILES Cc1cc(cc2n(C)c(Cc3c(Cl)ccc(C(=O)N4CCOCC4)c3Cl)cc12)C#N
InChI Key InChIKey=ZKASOECVISRZCR-UHFFFAOYSA-N
Data  1 IC50
  Tab Delimited (TSV)   2D SDfile   Computed 3D by Vconf -m prep SDfile
Find this compound or compounds like it in BindingDB:
Activity Spreadsheet -- Enzyme Inhibition Constant Data from BindingDB
Found 1 hit for monomerid = 293046
TargetNuclear receptor ROR-gamma(Homo sapiens (Human))
Abbvie
US Patent
LigandPNGBDBM293046(US10106501, Example AA-35)
Affinity DataIC50: <100nM. Assay description: The primary screen was performed by transient transactivation assays. These cell-based assays were carried out using Cos-7 cells transfected with a c...
Ligand InfoPC cidPC sid
In DepthDetails US Patent