BDBM293081 US10106501, Example AP-1
SMILES Cc1cc(cc2n(C)c(cc12)C(=O)c1c(Cl)ccc(C(=O)N2CCN(CC2)C2COC2)c1Cl)C(F)(F)F
InChI Key InChIKey=YONVQCJWEMILRR-UHFFFAOYSA-N
Data  1 IC50
  Tab Delimited (TSV)   2D SDfile   Computed 3D by Vconf -m prep SDfile
Find this compound or compounds like it in BindingDB:
Activity Spreadsheet -- Enzyme Inhibition Constant Data from BindingDB
Found 1 hit for monomerid = 293081
TargetNuclear receptor ROR-gamma(Homo sapiens (Human))
Abbvie
US Patent
LigandPNGBDBM293081(US10106501, Example AP-1)
Affinity DataIC50: <100nM. Assay description: The primary screen was performed by transient transactivation assays. These cell-based assays were carried out using Cos-7 cells transfected with a c...
Ligand InfoPC cidPC sid
In DepthDetails US Patent