BDBM293082 US10106501, Example AQ
SMILES Cc1cc(cc2n(C)c(cc12)C(=O)c1c(Cl)ccc(C(=O)N2CCC(CC(O)=O)CC2)c1Cl)C(F)(F)F
InChI Key InChIKey=MQPIAMQRLSAESP-UHFFFAOYSA-N
Data  1 IC50
  Tab Delimited (TSV)   2D SDfile   Computed 3D by Vconf -m prep SDfile
Find this compound or compounds like it in BindingDB:
Activity Spreadsheet -- Enzyme Inhibition Constant Data from BindingDB
Found 1 hit for monomerid = 293082
TargetNuclear receptor ROR-gamma(Homo sapiens (Human))
Abbvie
US Patent
LigandPNGBDBM293082(US10106501, Example AQ)
Affinity DataIC50: <100nM. Assay description: The primary screen was performed by transient transactivation assays. These cell-based assays were carried out using Cos-7 cells transfected with a c...
Ligand InfoPC cidPC sid
In DepthDetails US Patent