BDBM293100 US10106501, Example BF-1
SMILES Cc1cc(cc2n(C)c(Cc3c(Cl)cnc(C(=O)N4CCC(CC4)C4COC4)c3Cl)cc12)C#N
InChI Key InChIKey=AMUURDPUDWOJRY-UHFFFAOYSA-N
Data  1 IC50
  Tab Delimited (TSV)   2D SDfile   Computed 3D by Vconf -m prep SDfile
Find this compound or compounds like it in BindingDB:
Activity Spreadsheet -- Enzyme Inhibition Constant Data from BindingDB
Found 1 hit for monomerid = 293100
TargetNuclear receptor ROR-gamma(Homo sapiens (Human))
Abbvie
US Patent
LigandPNGBDBM293100(US10106501, Example BF-1)
Affinity DataIC50: <100nM. Assay description: The primary screen was performed by transient transactivation assays. These cell-based assays were carried out using Cos-7 cells transfected with a c...
Ligand InfoPC cidPC sid
In DepthDetails US Patent