BDBM293414 US10106522, Compound I-11 in CN 103896915
SMILES OC(=O)c1ccc(OCCN2CCC(CC2)c2nc3ccccc3n2CCOc2ccccc2)cc1
InChI Key InChIKey=HBZYGZURDNUWEK-UHFFFAOYSA-N
Data  1 IC50
  Tab Delimited (TSV)   2D SDfile   Computed 3D by Vconf -m prep SDfile
Find this compound or compounds like it in BindingDB:
Activity Spreadsheet -- Enzyme Inhibition Constant Data from BindingDB
Found 1 hit for monomerid = 293414
TargetHistamine H1 receptor(Homo sapiens (Human))
Faes Farma
US Patent
LigandPNGBDBM293414(US10106522, Compound I-11 in CN 103896915)
Affinity DataIC50:  260nMpH: 7.4 T: 2°C. Assay description: Affinity for histamine H1-receptor was determined by binding studies to H1 receptors. The sample used is a suspension of membranes of CHO cells trans...
Ligand InfoPC cidPC sid
In DepthDetails US Patent