BDBM293879 (R)-1-(3-Fluoro-2- methylphenyl)-3-(5- fluoropyridin-3-yl)-N- hydroxycyclopent-2- enecarboxamide::US10106535, Example 5::US9617259, 5
SMILES Cc1c(F)cccc1[C@]1(CCC(=C1)c1cncc(F)c1)C(=O)NO
InChI Key InChIKey=UBYLOIIQGDRWBE-GOSISDBHSA-N
Data  2 IC50
  Tab Delimited (TSV)   2D SDfile   Computed 3D by Vconf -m prep SDfile
Find this compound or compounds like it in BindingDB:
Activity Spreadsheet -- Enzyme Inhibition Constant Data from BindingDB
Found 2 hits for monomerid = 293879
TargetHistone deacetylase 4(Homo sapiens (Human))
Chdi Foundation
US Patent
LigandPNGBDBM293879((R)-1-(3-Fluoro-2- methylphenyl)-3-(5- fluoropyrid...)
Affinity DataIC50:  670nM. Assay description: 2 μl (200×) of each diluted solution and each control (full activity: 100% DMSO alone or full inhibition 1 mM) is stamped into V-bottomed polypr...
Ligand InfoPC cidPC sid
In DepthDetails US Patent
TargetHistone deacetylase 4(Homo sapiens (Human))
Chdi Foundation
US Patent
LigandPNGBDBM293879((R)-1-(3-Fluoro-2- methylphenyl)-3-(5- fluoropyrid...)
Affinity DataIC50:  670nM. Assay description: 5 μl of each solution of 1:20 diluted compound from above is transferred to a clear bottomed, black, 384-well assay plate using the Bravo or the...
Ligand InfoPC cidPC sid
In DepthDetails US Patent