BDBM293891 (S)-1-(3-Fluoro-2- methylphenyl)-N- hydroxy-3-(5- (trifluoromethyl)pyridin- 3-yl)cyclopent-2- enecarboxamide::US10106535, Example 17::US9617259, 17
SMILES Cc1c(F)cccc1[C@@]1(CCC(=C1)c1cncc(c1)C(F)(F)F)C(=O)NO
InChI Key InChIKey=GGFUMFGWFPMRIT-SFHVURJKSA-N
Data  2 IC50
  Tab Delimited (TSV)   2D SDfile   Computed 3D by Vconf -m prep SDfile
Find this compound or compounds like it in BindingDB:
Activity Spreadsheet -- Enzyme Inhibition Constant Data from BindingDB
Found 2 hits for monomerid = 293891
TargetHistone deacetylase 4(Homo sapiens (Human))
Chdi Foundation
US Patent
LigandPNGBDBM293891((S)-1-(3-Fluoro-2- methylphenyl)-N- hydroxy-3-(5- ...)
Affinity DataIC50:  30nM. Assay description: 2 μl (200×) of each diluted solution and each control (full activity: 100% DMSO alone or full inhibition 1 mM) is stamped into V-bottomed polypr...
Ligand InfoPC cidPC sid
In DepthDetails US Patent
TargetHistone deacetylase 4(Homo sapiens (Human))
Chdi Foundation
US Patent
LigandPNGBDBM293891((S)-1-(3-Fluoro-2- methylphenyl)-N- hydroxy-3-(5- ...)
Affinity DataIC50:  30nM. Assay description: 5 μl of each solution of 1:20 diluted compound from above is transferred to a clear bottomed, black, 384-well assay plate using the Bravo or the...
Ligand InfoPC cidPC sid
In DepthDetails US Patent