BDBM299911 4-[4-({[2-amino-5- (1-methyl-1H- imidazol-4- yl)pyridin-3- yl]oxy}methyl) piperidin-1-yl]-N- [(2R)-3-hydroxy-3- methylbutan-2-yl]- 6-[(2R)- tetrahydrofuran-2- ylmethoxy]-1,3,5- triazine-2- carboxamide::US9593097, Example 281
SMILES C[C@@H](NC(=O)c1nc(OC[C@H]2CCCO2)nc(n1)N1CCC(COc2cc(cnc2N)-c2cn(C)cn2)CC1)C(C)(C)O
InChI Key InChIKey=KVOCVVYYZRCYOY-WIYYLYMNSA-N
Data  1 KI
  Tab Delimited (TSV)   2D SDfile   Computed 3D by Vconf -m prep SDfile
Find this compound or compounds like it in BindingDB:
Activity Spreadsheet -- Enzyme Inhibition Constant Data from BindingDB
Found 1 hit for monomerid = 299911
TargetTyrosine-protein kinase receptor UFO(Homo sapiens (Human))
Pfizer
US Patent
LigandPNGBDBM299911(4-[4-({[2-amino-5- (1-methyl-1H- imidazol-4- yl)py...)
Affinity DataKi:  0.0340nM. Assay description: AXL enzyme inhibition (% inhibition, Kiapp and Ki values) by small molecule inhibitors was evaluated using a fluorescence-based microfluidic mobility...
Ligand InfoPC cidPC sid
In DepthDetails US Patent