BDBM300071 N-[(2R)-1- hydroxypropan-2- yl]-4-[4-(4- methoxy-1H- pyrrolo[2,3- b]pyridin-3- yl)piperidin-1-yl]-6- [(2R)- tetrahydrofuran-2- ylmethoxy]-1,3,5- triazine-2- carboxamide::US9593097, Example 451
SMILES COc1ccnc2[nH]cc(C3CCN(CC3)c3nc(OC[C@H]4CCCO4)nc(n3)C(=O)N[C@H](C)CO)c12
InChI Key
Data  1 KI
  Tab Delimited (TSV)   2D SDfile   Computed 3D by Vconf -m prep SDfile
Find this compound or compounds like it in BindingDB:
Activity Spreadsheet -- Enzyme Inhibition Constant Data from BindingDB
Found 1 hit for monomerid = 300071
TargetTyrosine-protein kinase receptor UFO(Homo sapiens (Human))
Pfizer
US Patent
LigandPNGBDBM300071(N-[(2R)-1- hydroxypropan-2- yl]-4-[4-(4- methoxy-1...)
Affinity DataKi:  0.0300nM. Assay description: AXL enzyme inhibition (% inhibition, Kiapp and Ki values) by small molecule inhibitors was evaluated using a fluorescence-based microfluidic mobility...
Ligand InfoPC cidPC sid
In DepthDetails US Patent