BDBM300079 N-[(2R)-1- hydroxypropan-2- yl]-6-[4-(4- methoxy-1H- pyrrolo[2,3- b]pyridin-3- yl)piperidin-1-yl]-2- [(2R)- tetrahydrofuran-2- ylmethoxy] pyrimidine- 4-carboxamide::US9593097, Example 459
SMILES COc1ccnc2[nH]cc(C3CCN(CC3)c3cc(nc(OC[C@H]4CCCO4)n3)C(=O)N[C@H](C)CO)c12
InChI Key
Data  1 KI
  Tab Delimited (TSV)   2D SDfile   Computed 3D by Vconf -m prep SDfile
Find this compound or compounds like it in BindingDB:
Activity Spreadsheet -- Enzyme Inhibition Constant Data from BindingDB
Found 1 hit for monomerid = 300079
TargetTyrosine-protein kinase receptor UFO(Homo sapiens (Human))
Pfizer
US Patent
LigandPNGBDBM300079(N-[(2R)-1- hydroxypropan-2- yl]-6-[4-(4- methoxy-1...)
Affinity DataKi: <0.0130nM. Assay description: AXL enzyme inhibition (% inhibition, Kiapp and Ki values) by small molecule inhibitors was evaluated using a fluorescence-based microfluidic mobility...
Ligand InfoPC cidPC sid
In DepthDetails US Patent