BDBM300228 US9593127, Example 2::[3-[2-(3-chlorophenyl)ethynyl]- 3a,4,5,6a- tetrahydropyrrolo[3,2- d]isoxazol-6-yl]-(2- furyl)methanone
SMILES Clc1cccc(c1)C#CC1=NOC2C1CCN2C(=O)c1ccco1
InChI Key InChIKey=KDYHSOJZPXBDIQ-UHFFFAOYSA-N
Data  1 IC50
  Tab Delimited (TSV)   2D SDfile   Computed 3D by Vconf -m prep SDfile
Find this compound or compounds like it in BindingDB:
Activity Spreadsheet -- Enzyme Inhibition Constant Data from BindingDB
Found 1 hit for monomerid = 300228
TargetMetabotropic glutamate receptor 5(Homo sapiens (Human))
Recordati Ireland
US Patent
LigandPNGBDBM300228(US9593127, Example 2 | [3-[2-(3-chlorophenyl)ethyn...)
Affinity DataIC50:  29.6nM. Assay description: Affinity at transmembrane glutamate metabotropic mGluR5 receptor subtypes was evaluated according to the methods of Anderson (Anderson et al., J Phar...
Ligand InfoPC cidPC sid
In DepthDetails US Patent