BDBM300369 US10130619, Example 45
SMILES Cc1nc(OCc2ccccc2)ccc1C(=O)Nc1nnc(s1)-c1ccncc1
InChI Key InChIKey=WBOTWSZCCILOQN-UHFFFAOYSA-N
Data  1 KI
  Tab Delimited (TSV)   2D SDfile   Computed 3D by Vconf -m prep SDfile
Find this compound or compounds like it in BindingDB:
Activity Spreadsheet -- Enzyme Inhibition Constant Data from BindingDB
Found 1 hit for monomerid = 300369
TargetNADPH oxidase 1(Homo sapiens (Human))
Genkyotex Suisse
US Patent
LigandPNGBDBM300369(US10130619, Example 45)
Affinity DataKi:  77nM. Assay description: All solutions were placed on ice and protected from light. The final concentration in the 1x hNOX1 membrane fluorescent assay buffer was PBS pH7, 6 &...
Ligand InfoPC cidPC sid
In DepthDetails US Patent